{"text_format":"1","workbook":"xlsx","n_sheets":19,"sheets":["STEP 1--Field Information","STEP 2--Soil Test Information","Veg rec lookup","STEP 3--Nutrient Needs","Crop look up","STEP 4--Choose N","N lookup","STEP 5--Choose P","P lookup","STEP 6--Choose K","K lookup","STEP 7--Fertilizer Costs","Calcium","Magnesium","Sulfur","Trace Element ","STEP 8--Amendment Plan","Appendix--Fertilizer Costs","Cost per pound of Nutrients"],"not_rendered":{"charts":0,"images":0,"macros":1,"external_links":1,"defined_names":5,"comments":3,"pivot_tables":0},"unopened":[],"bounds":{"document_bytes":16777216,"sheet_cells":100000,"rows_first":2000,"rows_last":500,"rows_between":2000,"halvings":0,"cell_chars":16384,"cell_head_chars":4096},"cells_cut":0,"cells_raw":0,"read":"whole","date_system":"1904"}

{"sheet":"STEP 1--Field Information","index":0,"n_rows":67,"n_cols":6,"rows_kept":67,"cut":false,"hidden":false,"merged":[[0,0,0,5],[9,0,9,3],[7,0,7,3]]}
["In the yellow cells below, enter descriptive information about a field. You can obtain calculations that are based on: acres,  OR length and width of beds, OR total square footage of growing area."]
[]
[]
[null,null,null,"Farm Name:"]
[null,null,null,null,null,"Acres:"]
[null,null,null,"Field name :"]
{"$rows_left_out":62}
{"sheet":"STEP 2--Soil Test Information","index":1,"n_rows":39,"n_cols":3,"rows_kept":39,"cut":false,"hidden":false,"merged":[[0,0,0,1],[25,0,26,1]]}
["Instructions: Enter the information from your soil test results in the yellow cells. Select P and K levels from drop down menus. Only enter information from a soil test lab that uses the modified Morgan's extract (UVM, UMass, UMaine, Dairy One in NY)"]
[]
["Field Name",{"$f":"'STEP 1--Field Information'!E6","v":0}]
["pH"]
["Phosphorus (enter ppm P--if your results are in lbs/acre, divide that number by 2 for ppm)"]
["Potasssium (enter ppm K--if your results are in lbs/acre, divide that number by 2 for ppm)"]
{"$rows_left_out":34}
{"sheet":"Veg rec lookup","index":2,"n_rows":112,"n_cols":10,"rows_kept":112,"cut":false,"hidden":true,"merged":[]}
["Crop","Under 2 ppm","2-3 ppm","3-4 ppm","4-6 ppm","7-9 ppm","10-13 ppm","14-17 ppm","18-20 ppm","Over 20 ppm"]
["Blueberries - Establishment",60,40,20,20,0,0,0,0,0]
["Blueberries - Maintenance",50,30,20,0,0,0,0,0,0]
["Cranberries - Establishment"]
["Cranberries - Maintenance"]
["Hops - Establishment",120,100,80,60,30,0,0,0,0]
{"$rows_left_out":107}
{"sheet":"STEP 3--Nutrient Needs","index":3,"n_rows":11,"n_cols":5,"rows_kept":11,"cut":false,"hidden":false,"merged":[[0,0,0,4],[12,0,12,3]]}
["Instructions: In the yellow highlighted areas, enter the necessary information. All shaded areas will autofill, but you can overwrite those numbers if you choose. Leave blank whatever you don't know or is not applicable. (If your soil test results are reported in 1000 square feet, multiply the recommendations by 43.5 to convert to pounds per acre)"]
[null,"ENTER YOUR VALUES IN YELLOW SQUARES:","N ","P2O5 ","K2O"]
["Nitrogen recommendations (lbs/ acre)",{"$f":"VLOOKUP('STEP 1--Field Information'!E8,'Crop look up'!A2:B44,2,FALSE)","v":100},{"$f":"B3","v":100}]
["Phosphate recommendations (lbs/acre)",{"$f":"VLOOKUP('STEP 1--Field Information'!E8,'Veg rec lookup'!A1:J55, MATCH('STEP 2--Soil Test Information'!B5,'Veg rec lookup'!A1:J1,0), FALSE)","v":{"$error":"#N/A"}},null,{"$f":"B4","v":{"$error":"#N/A"}}]
["Potash recommendations (lbs/acre)",{"$f":"VLOOKUP('STEP 1--Field Information'!E8,'Veg rec lookup'!A58:I112,MATCH('STEP 2--Soil Test Information'!B6,'Veg rec lookup'!A58:I58,0), FALSE)","v":{"$error":"#N/A"}},null,null,{"$f":"B5","v":{"$error":"#N/A"}}]
["% soil organic matter",{"$f":"'STEP 2--Soil Test Information'!B20","v":0},{"$f":"MIN(40,B6*10)","v":0}]
{"$rows_left_out":6}
{"sheet":"Crop look up","index":4,"n_rows":44,"n_cols":5,"rows_kept":44,"cut":false,"hidden":true,"merged":[]}
[null,"N"]
["Blueberries - Establishment",0,null,"Rye",25]
["Blueberries - Maintenance",10,null,"Oat, leonard",10]
["Raspberries/Brambles -Establishment",0,null,"Hairy vetch, spring incorp",50]
["Raspberries/Brambles - Maintenance",75,null,"Hairy vetch, mid summer incorp",80]
["Strawberries - Establishment",50,null,"Red clover, spring incorp",50]
{"$rows_left_out":39}
{"sheet":"STEP 4--Choose N","index":5,"n_rows":37,"n_cols":10,"rows_kept":37,"cut":false,"hidden":false,"merged":[[36,0,36,7],[0,0,0,9],[1,0,1,2],[1,3,1,4],[2,0,2,1],[4,0,4,9]]}
["Instructions: Select your nitrogen amendment from the drop down menu in the yellow cell after reviewing the chart below. If you have a custom blend or a product with a unique analysis, enter the analysis at the bottom of the chart to the right of \"other\"."]
["Select Your Nitrogen Amendment---->"]
["Based on your nutrient calculations, you should apply",null,{"$f":"'STEP 3--Nutrient Needs'!C11","v":100},"lbs N/ acre"]
[]
["POSSIBLE NITROGEN AMENDMENTS"]
["AMENDMENT NAME",{"$f":"'Appendix--Fertilizer Costs'!B1","v":"% N"},{"$f":"'Appendix--Fertilizer Costs'!C1","v":"% P2O5"},{"$f":"'Appendix--Fertilizer Costs'!D1","v":"% K20"},{"$f":"'Appendix--Fertilizer Costs'!E1","v":"% Ca"},{"$f":"'Appendix--Fertilizer Costs'!F1","v":"% Mg"},{"$f":"'Appendix--Fertilizer Costs'!G1","v":"% S"},{"$f":"'Appendix--Fertilizer Costs'!H1","v":"Release Rate"},{"$f":"'Appendix--Fertilizer Costs'!I1","v":"Price per 50 lb"},{"$f":"'Appendix--Fertilizer Costs'!J1","v":"$/lb N"}]
{"$rows_left_out":32}
{"sheet":"N lookup","index":6,"n_rows":47,"n_cols":18,"rows_kept":47,"cut":false,"hidden":true,"merged":[]}
["Material","% N","%P2 O5","%K20","%Ca","%Mg","%S","Relative Availability","Price per 50 lb ","Price per pound of N","Pounds of fertilizer to meet your N needs (for your specified area)","P205 Contributions","K20 Contributions","PoundsCa","Pounds Mg","Pounds S","Estimated Cost of fertilizer","Divide by to accout for availability (% avail)"]
[{"$f":"'Appendix--Fertilizer Costs'!A2","v":"Alfalfa meal"},{"$f":"'Appendix--Fertilizer Costs'!B2","v":0.03},{"$f":"'Appendix--Fertilizer Costs'!C2","v":5.0000000000000001E-3},{"$f":"'Appendix--Fertilizer Costs'!D2","v":2.5000000000000001E-2},{"$f":"'Appendix--Fertilizer Costs'!E2","v":0},{"$f":"'Appendix--Fertilizer Costs'!F2","v":0},{"$f":"'Appendix--Fertilizer Costs'!G2","v":0},{"$f":"'Appendix--Fertilizer Costs'!H2","v":"slow/ med"},{"$f":"'Appendix--Fertilizer Costs'!I2","v":30},{"$f":"'Appendix--Fertilizer Costs'!J2","v":20},{"$f":"('STEP 3--Nutrient Needs'!C11/B2)/R2","v":5555.5555555555557},{"$f":"K2*C2","v":27.777777777777779},{"$f":"K2*D2","v":138.88888888888889},null,null,null,{"$f":"K2*J2*B2","v":3333.333333333333},0.6]
[{"$f":"'Appendix--Fertilizer Costs'!A3","v":"Ammonium sulfate"},{"$f":"'Appendix--Fertilizer Costs'!B3","v":0.21},{"$f":"'Appendix--Fertilizer Costs'!C3","v":0},{"$f":"'Appendix--Fertilizer Costs'!D3","v":0},{"$f":"'Appendix--Fertilizer Costs'!E3","v":0},{"$f":"'Appendix--Fertilizer Costs'!F3","v":0},{"$f":"'Appendix--Fertilizer Costs'!G3","v":0.23},{"$f":"'Appendix--Fertilizer Costs'!H3","v":"rapid"},{"$f":"'Appendix--Fertilizer Costs'!I3","v":10.7},{"$f":"'Appendix--Fertilizer Costs'!J3","v":1.019047619047619},{"$f":"('STEP 3--Nutrient Needs'!C11/B3)/R3","v":476.1904761904762},null,null,null,null,{"$f":"G3*K3","v":109.52380952380953},{"$f":"K3*B3*J3","v":101.9047619047619},1]
[{"$f":"'Appendix--Fertilizer Costs'!A4","v":"Blood meal"},{"$f":"'Appendix--Fertilizer Costs'!B4","v":0.12},{"$f":"'Appendix--Fertilizer Costs'!C4","v":0.01},{"$f":"'Appendix--Fertilizer Costs'!D4","v":5.0000000000000001E-3},{"$f":"'Appendix--Fertilizer Costs'!E4","v":0},{"$f":"'Appendix--Fertilizer Costs'!F4","v":0},{"$f":"'Appendix--Fertilizer Costs'!G4","v":0},{"$f":"'Appendix--Fertilizer Costs'!H4","v":"med/ rapid"},{"$f":"'Appendix--Fertilizer Costs'!I4","v":68},{"$f":"'Appendix--Fertilizer Costs'!J4","v":11.333333333333334},{"$f":"('STEP 3--Nutrient Needs'!C11/B4)/R4","v":1366.1202185792351},{"$f":"K4*C4","v":13.661202185792352},{"$f":"K4*D4","v":6.8306010928961758},null,null,null,1857.9234972677598,0.61]
[{"$f":"'Appendix--Fertilizer Costs'!A6","v":"Bone meal"},{"$f":"'Appendix--Fertilizer Costs'!B6","v":0.03},{"$f":"'Appendix--Fertilizer Costs'!C6","v":0.2},{"$f":"'Appendix--Fertilizer Costs'!D6","v":0},{"$f":"'Appendix--Fertilizer Costs'!E6","v":0},{"$f":"'Appendix--Fertilizer Costs'!F6","v":0},{"$f":"'Appendix--Fertilizer Costs'!G6","v":0},{"$f":"'Appendix--Fertilizer Costs'!H6","v":"med"},{"$f":"'Appendix--Fertilizer Costs'!I6","v":39},{"$f":"'Appendix--Fertilizer Costs'!J6","v":26},{"$f":"('STEP 3--Nutrient Needs'!C11/B5)/R5","v":10416.666666666666},{"$f":"K5*C5","v":2083.3333333333335},0,null,null,null,8124.9999999999982,0.32]
[{"$f":"'Appendix--Fertilizer Costs'!A8","v":"Calcium nitrate"},{"$f":"'Appendix--Fertilizer Costs'!B8","v":0.15},{"$f":"'Appendix--Fertilizer Costs'!C8","v":0},{"$f":"'Appendix--Fertilizer Costs'!D8","v":0},{"$f":"'Appendix--Fertilizer Costs'!E8","v":0.19},{"$f":"'Appendix--Fertilizer Costs'!F8","v":0},{"$f":"'Appendix--Fertilizer Costs'!G8","v":0},{"$f":"'Appendix--Fertilizer Costs'!H8","v":"rapid"},{"$f":"'Appendix--Fertilizer Costs'!I8","v":21.85},{"$f":"'Appendix--Fertilizer Costs'!J8","v":2.9133333333333336},{"$f":"('STEP 3--Nutrient Needs'!C11/B6)/R6","v":666.66666666666674},null,null,{"$f":"K6*E6","v":126.66666666666669},null,null,291.33333333333337,1]
{"$rows_left_out":42}
{"sheet":"STEP 5--Choose P","index":7,"n_rows":29,"n_cols":10,"rows_kept":29,"cut":false,"hidden":false,"merged":[[0,0,0,9],[28,0,28,7],[1,0,1,2],[1,3,1,5],[2,0,2,1],[3,0,3,1],[5,0,5,9]]}
["Instructions: Select your phosphate amendment from the drop down menu in the yellow cell after reviewing the chart below."]
["Select Your Phosphate Amendment->",null,null,"NONE NEEDED"]
["Your N selection contributes",null,{"$f":"VLOOKUP('STEP 4--Choose N'!D2,'N lookup'!A2:Q47,12,FALSE)","v":{"$error":"#N/A"}},"lbs P205/ acre"]
["You should apply an additional",null,{"$f":"('STEP 3--Nutrient Needs'!D11)-VLOOKUP('STEP 4--Choose N'!D2,'N lookup'!A2:Q47,12,FALSE)","v":{"$error":"#N/A"}},"lbs P205/ acre"]
[]
["POSSIBLE PHOSPHATE AMENDMENTS"]
{"$rows_left_out":24}
{"sheet":"P lookup","index":8,"n_rows":17,"n_cols":16,"rows_kept":17,"cut":false,"hidden":true,"merged":[]}
[{"$f":"'STEP 5--Choose P'!A7","v":"MATERIAL"},{"$f":"'STEP 5--Choose P'!B7","v":"% N"},{"$f":"'STEP 5--Choose P'!C7","v":"% P2O5"},{"$f":"'STEP 5--Choose P'!D7","v":"% K20"},{"$f":"'STEP 5--Choose P'!E7","v":"% Ca"},{"$f":"'STEP 5--Choose P'!F7","v":"% Mg"},{"$f":"'STEP 5--Choose P'!G7","v":"% S"},{"$f":"'STEP 5--Choose P'!H7","v":"Release Rate"},{"$f":"'STEP 5--Choose P'!I7","v":"Price per 50 lb"},{"$f":"'STEP 5--Choose P'!J7","v":"$/lb P"},"Pounds of P205 fertilizer per acre (accounts for any P205 in your N fertilizer selection)","K20 Contributions (pounds) ","PoundsCa","Pounds Mg","Pounds S","Estimated Cost"]
[{"$f":"'STEP 5--Choose P'!A8","v":"Bone char"},null,0.16,null,null,null,null,"med",{"$f":"'STEP 5--Choose P'!I8","v":34},{"$f":"I2*2/(C2*100)","v":4.25},{"$f":"('STEP 3--Nutrient Needs'!D11/C2)-(VLOOKUP('STEP 4--Choose N'!D2,'N lookup'!A2:Q47,12,FALSE)/C2)","v":{"$error":"#N/A"}},{"$f":"K2*D2","v":{"$error":"#N/A"}},null,null,null,{"$f":"(K2*I2)/50","v":{"$error":"#N/A"}}]
[{"$f":"'STEP 5--Choose P'!A9","v":"Bone meal"},0.03,0.22,null,null,null,null,"med",{"$f":"'STEP 5--Choose P'!I9","v":39},{"$f":"78/22","v":3.5454545454545454},{"$f":"('STEP 3--Nutrient Needs'!D11/C3)-VLOOKUP('STEP 4--Choose N'!D2,'N lookup'!A2:Q47,12,FALSE)/C3","v":{"$error":"#N/A"}},{"$f":"K3*D3","v":{"$error":"#N/A"}},null,null,null,{"$error":"#N/A"}]
[{"$f":"'STEP 5--Choose P'!A10","v":"Dehydrated Poultry Manure (Kreher's or other)"},{"$f":"'STEP 5--Choose P'!B10","v":0.05},{"$f":"'STEP 5--Choose P'!C10","v":0.04},{"$f":"'STEP 5--Choose P'!D10","v":0.03},{"$f":"'STEP 5--Choose P'!E10","v":0.09},{"$f":"'STEP 5--Choose P'!F10","v":0},{"$f":"'STEP 5--Choose P'!G10","v":0},{"$f":"'STEP 5--Choose P'!H10","v":"med"},{"$f":"'STEP 5--Choose P'!I10","v":15},{"$f":"'STEP 5--Choose P'!J10","v":7.5},{"$f":"('STEP 3--Nutrient Needs'!D11/C4)-VLOOKUP('STEP 4--Choose N'!D2,'N lookup'!A2:Q47,12,FALSE)/C4","v":{"$error":"#N/A"}},{"$error":"#N/A"},null,null,null,{"$error":"#N/A"}]
[{"$f":"'STEP 5--Choose P'!A11","v":"Dehydrated High-K Blend Poultry Manure (Kreher's or other)"},{"$f":"'STEP 5--Choose P'!B11","v":0.04},{"$f":"'STEP 5--Choose P'!C11","v":0.03},{"$f":"'STEP 5--Choose P'!D11","v":0.1},{"$f":"'STEP 5--Choose P'!E11","v":0},{"$f":"'STEP 5--Choose P'!F11","v":0},{"$f":"'STEP 5--Choose P'!G11","v":0},{"$f":"'STEP 5--Choose P'!H11","v":"med"},{"$f":"'STEP 5--Choose P'!I11","v":15},{"$f":"'STEP 5--Choose P'!J11","v":10},{"$f":"('STEP 3--Nutrient Needs'!D11/C5)-VLOOKUP('STEP 4--Choose N'!D2,'N lookup'!A2:Q47,12,FALSE)/C5","v":{"$error":"#N/A"}},{"$error":"#N/A"},null,null,null,{"$error":"#N/A"}]
[{"$f":"'STEP 5--Choose P'!A12","v":"Diammonium phosphate"},{"$f":"'STEP 5--Choose P'!B12","v":0},{"$f":"'STEP 5--Choose P'!C12","v":0.46},{"$f":"'STEP 5--Choose P'!D12","v":0},{"$f":"'STEP 5--Choose P'!E12","v":0},{"$f":"'STEP 5--Choose P'!F12","v":0},{"$f":"'STEP 5--Choose P'!G12","v":0},{"$f":"'STEP 5--Choose P'!H12","v":"rapid"},{"$f":"'STEP 5--Choose P'!I12","v":11.824999999999999},{"$f":"'STEP 5--Choose P'!J12","v":0.51413043478260867},{"$f":"('STEP 3--Nutrient Needs'!D11/C6)-VLOOKUP('STEP 4--Choose N'!D2,'N lookup'!A2:Q47,12,FALSE)/C6","v":{"$error":"#N/A"}},{"$error":"#N/A"},null,null,null,{"$error":"#N/A"}]
{"$rows_left_out":12}
{"sheet":"STEP 6--Choose K","index":9,"n_rows":24,"n_cols":10,"rows_kept":24,"cut":false,"hidden":false,"merged":[[0,0,0,9],[1,0,1,3],[23,0,23,5],[1,4,1,6],[2,0,2,2],[3,0,3,2],[4,0,4,9]]}
["Instructions: Select your potash amendments from the drop down menu in the yellow cell after reviewing the chart below."]
["Select Your Potash Amendments --->",null,null,null,"NONE NEEDED"]
["Your N and P205 selections contribute",null,null,{"$f":"VLOOKUP('STEP 4--Choose N'!D2,'N lookup'!A2:Q47,13,FALSE)+VLOOKUP('STEP 5--Choose P'!D2,'P lookup'!A2:L16,12,FALSE)","v":{"$error":"#N/A"}},"lbs K20/ acre"]
["You still need to add",null,null,{"$f":"('STEP 3--Nutrient Needs'!E11)-(VLOOKUP('STEP 4--Choose N'!D2,'N lookup'!A2:Q47,13,FALSE)+VLOOKUP('STEP 5--Choose P'!D2,'P lookup'!A2:L16,12,FALSE))","v":{"$error":"#N/A"}},"lbs K20/ acre"]
["POSSIBLE POTASH AMENDMENTS"]
[{"$f":"'Appendix--Fertilizer Costs'!A1","v":"MATERIAL"},{"$f":"'Appendix--Fertilizer Costs'!B1","v":"% N"},{"$f":"'Appendix--Fertilizer Costs'!C1","v":"% P2O5"},{"$f":"'Appendix--Fertilizer Costs'!D1","v":"% K20"},{"$f":"'Appendix--Fertilizer Costs'!E1","v":"% Ca"},{"$f":"'Appendix--Fertilizer Costs'!F1","v":"% Mg"},{"$f":"'Appendix--Fertilizer Costs'!G1","v":"% S"},{"$f":"'Appendix--Fertilizer Costs'!H1","v":"Release Rate"},{"$f":"'Appendix--Fertilizer Costs'!I1","v":"Price per 50 lb"},{"$f":"'Appendix--Fertilizer Costs'!L1","v":"$/lb K"}]
{"$rows_left_out":19}
{"sheet":"K lookup","index":10,"n_rows":17,"n_cols":15,"rows_kept":17,"cut":false,"hidden":true,"merged":[]}
[{"$f":"'STEP 6--Choose K'!A6","v":"MATERIAL"},{"$f":"'STEP 6--Choose K'!B6","v":"% N"},{"$f":"'STEP 6--Choose K'!C6","v":"% P2O5"},{"$f":"'STEP 6--Choose K'!D6","v":"% K20"},{"$f":"'STEP 6--Choose K'!E6","v":"% Ca"},{"$f":"'STEP 6--Choose K'!F6","v":"% Mg"},{"$f":"'STEP 6--Choose K'!G6","v":"% S"},{"$f":"'STEP 6--Choose K'!H6","v":"Release Rate"},{"$f":"'STEP 6--Choose K'!I6","v":"Price per 50 lb"},{"$f":"'STEP 6--Choose K'!J6","v":"$/lb K"},"Pounds of K20 fertilizer per acre (accounts for any K20 in your N&P fertilizer selection)","PoundsCa","Pounds Mg","Pounds S","Estimated Cost"]
[{"$f":"'STEP 6--Choose K'!A7","v":"Dehydrated Poultry Manure (Kreher's or other)"},{"$f":"'STEP 6--Choose K'!B7","v":0.05},{"$f":"'STEP 6--Choose K'!C7","v":0.04},{"$f":"'STEP 6--Choose K'!D7","v":0.03},{"$f":"'STEP 6--Choose K'!E7","v":0.09},{"$f":"'STEP 6--Choose K'!F7","v":0},{"$f":"'STEP 6--Choose K'!G7","v":0},{"$f":"'STEP 6--Choose K'!H7","v":"med"},{"$f":"'STEP 6--Choose K'!I7","v":15},{"$f":"'STEP 6--Choose K'!J7","v":10},{"$f":"('STEP 3--Nutrient Needs'!E11/D2)-((VLOOKUP('STEP 4--Choose N'!D2,'N lookup'!A2:Q47,13,FALSE)+VLOOKUP('STEP 5--Choose P'!D2,'P lookup'!A2:L16,12,FALSE))/D2)","v":{"$error":"#N/A"}},{"$f":"K2*E2","v":{"$error":"#N/A"}},{"$f":"K2*F2","v":{"$error":"#N/A"}},{"$f":"K2*G2","v":{"$error":"#N/A"}},{"$f":"K2/50*I2","v":{"$error":"#N/A"}}]
[{"$f":"'STEP 6--Choose K'!A8","v":"Dehydrated High-K Blend Poultry Manure (Kreher's or other)"},{"$f":"'STEP 6--Choose K'!B8","v":0.04},{"$f":"'STEP 6--Choose K'!C8","v":0.03},{"$f":"'STEP 6--Choose K'!D8","v":0.1},{"$f":"'STEP 6--Choose K'!E8","v":0},{"$f":"'STEP 6--Choose K'!F8","v":0},{"$f":"'STEP 6--Choose K'!G8","v":0},{"$f":"'STEP 6--Choose K'!H8","v":"med"},{"$f":"'STEP 6--Choose K'!I8","v":15},{"$f":"'STEP 6--Choose K'!J8","v":3},{"$f":"('STEP 3--Nutrient Needs'!E11/D3)-((VLOOKUP('STEP 4--Choose N'!D2,'N lookup'!A2:Q47,13,FALSE)+VLOOKUP('STEP 5--Choose P'!D2,'P lookup'!A2:L16,12,FALSE))/D3)","v":{"$error":"#N/A"}},{"$error":"#N/A"},{"$error":"#N/A"},{"$error":"#N/A"},{"$error":"#N/A"}]
[{"$f":"'STEP 6--Choose K'!A9","v":"Granite dust"},{"$f":"'STEP 6--Choose K'!B9","v":0},{"$f":"'STEP 6--Choose K'!C9","v":0},{"$f":"'STEP 6--Choose K'!D9","v":0.06},{"$f":"'STEP 6--Choose K'!E9","v":0},{"$f":"'STEP 6--Choose K'!F9","v":0.11},{"$f":"'STEP 6--Choose K'!G9","v":0.22},{"$f":"'STEP 6--Choose K'!H9","v":"very slow"},{"$f":"'STEP 6--Choose K'!I9","v":89},{"$f":"'STEP 6--Choose K'!J9","v":29.666666666666668},{"$f":"('STEP 3--Nutrient Needs'!E11/D4)-((VLOOKUP('STEP 4--Choose N'!D2,'N lookup'!A2:Q47,13,FALSE)+VLOOKUP('STEP 5--Choose P'!D2,'P lookup'!A2:L16,12,FALSE))/D4)","v":{"$error":"#N/A"}},{"$error":"#N/A"},{"$error":"#N/A"},{"$error":"#N/A"},{"$error":"#N/A"}]
[{"$f":"'STEP 6--Choose K'!A10","v":"Greensand"},{"$f":"'STEP 6--Choose K'!B10","v":0},{"$f":"'STEP 6--Choose K'!C10","v":0.01},{"$f":"'STEP 6--Choose K'!D10","v":7.0000000000000007E-2},{"$f":"'STEP 6--Choose K'!E10","v":0},{"$f":"'STEP 6--Choose K'!F10","v":0},{"$f":"'STEP 6--Choose K'!G10","v":0},{"$f":"'STEP 6--Choose K'!H10","v":"very slow"},{"$f":"'STEP 6--Choose K'!I10","v":31.5},{"$f":"'STEP 6--Choose K'!J10","v":8.9999999999999982},{"$f":"('STEP 3--Nutrient Needs'!E11/D5)-((VLOOKUP('STEP 4--Choose N'!D2,'N lookup'!A2:Q47,13,FALSE)+VLOOKUP('STEP 5--Choose P'!D2,'P lookup'!A2:L16,12,FALSE))/D5)","v":{"$error":"#N/A"}},{"$error":"#N/A"},{"$error":"#N/A"},{"$error":"#N/A"},{"$error":"#N/A"}]
[{"$f":"'STEP 6--Choose K'!A11","v":"K-mag"},{"$f":"'STEP 6--Choose K'!B11","v":0},{"$f":"'STEP 6--Choose K'!C11","v":0},{"$f":"'STEP 6--Choose K'!D11","v":0.22},{"$f":"'STEP 6--Choose K'!E11","v":0},{"$f":"'STEP 6--Choose K'!F11","v":0.11},{"$f":"'STEP 6--Choose K'!G11","v":0.22},{"$f":"'STEP 6--Choose K'!H11","v":"rapid"},{"$f":"'STEP 6--Choose K'!I11","v":38},{"$f":"'STEP 6--Choose K'!J11","v":3.4545454545454546},{"$f":"('STEP 3--Nutrient Needs'!E11/D6)-((VLOOKUP('STEP 4--Choose N'!D2,'N lookup'!A2:Q47,13,FALSE)+VLOOKUP('STEP 5--Choose P'!D2,'P lookup'!A2:L16,12,FALSE))/D6)","v":{"$error":"#N/A"}},{"$error":"#N/A"},{"$error":"#N/A"},{"$error":"#N/A"},{"$error":"#N/A"}]
{"$rows_left_out":12}
{"sheet":"STEP 7--Fertilizer Costs","index":11,"n_rows":10,"n_cols":7,"rows_kept":10,"cut":false,"hidden":false,"merged":[[0,0,0,6]]}
["The chart below collects the fertilizer you selected on the other worksheets for a total volume and cost of ammending the area specified in Step 1. "]
[]
[null,"Fertilizer","Pounds of fertilizer to add per acre","Relative availability of fertilizer","Estimated cost of fertilizer per acre","Pounds of fertilizer for your field","Estimated cost of fertilizer for your field "]
["N-->",{"$f":"'STEP 4--Choose N'!D2","v":0},{"$f":"ROUNDUP(VLOOKUP('STEP 4--Choose N'!D2,'N lookup'!A2:Q47,11,FALSE),-2)","v":{"$error":"#N/A"}},{"$f":"VLOOKUP('STEP 4--Choose N'!D2,'N lookup'!A2:Q47,8,FALSE)","v":{"$error":"#N/A"}},{"$f":"ROUNDUP(VLOOKUP('STEP 4--Choose N'!D2,'N lookup'!A2:Q47,17,FALSE),-1)","v":{"$error":"#N/A"}},{"$f":"ROUNDUP(VLOOKUP('STEP 4--Choose N'!D2,'N lookup'!A2:Q47,11,FALSE),-2)*'STEP 1--Field Information'!F23","v":{"$error":"#N/A"}},{"$f":"ROUNDUP(VLOOKUP('STEP 4--Choose N'!D2,'N lookup'!A2:Q47,17,FALSE),-1)*'STEP 1--Field Information'!F23","v":{"$error":"#N/A"}}]
["P-->",{"$f":"'STEP 5--Choose P'!D2","v":"NONE NEEDED"},{"$f":"ROUNDUP(VLOOKUP('STEP 5--Choose P'!D2,'P lookup'!A2:P16,11,FALSE),-2)","v":0},{"$f":"VLOOKUP('STEP 5--Choose P'!D2,'P lookup'!A2:P16,8,FALSE)","v":0},{"$f":"ROUNDUP(VLOOKUP('STEP 5--Choose P'!D2,'P lookup'!A2:P16,16,FALSE),-1)","v":0},{"$f":"ROUNDUP(VLOOKUP('STEP 5--Choose P'!D2,'P lookup'!A2:P16,11,FALSE),-2)*'STEP 1--Field Information'!F23","v":0},{"$f":"ROUNDUP(VLOOKUP('STEP 5--Choose P'!D2,'P lookup'!A2:P16,16,FALSE),-1)*'STEP 1--Field Information'!F23","v":0}]
["K-->",{"$f":"'STEP 6--Choose K'!E2","v":"NONE NEEDED"},{"$f":"ROUNDUP(VLOOKUP('STEP 6--Choose K'!E2,'K lookup'!A2:P17,11,FALSE),-1)","v":0},{"$f":"VLOOKUP('STEP 6--Choose K'!E2,'K lookup'!A2:P17,8,FALSE)","v":0},{"$f":"ROUNDUP(VLOOKUP('STEP 6--Choose K'!E2,'K lookup'!A2:P17,15,FALSE),-1)","v":0},{"$f":"ROUNDUP(VLOOKUP('STEP 6--Choose K'!E2,'K lookup'!A2:P17,11,FALSE),-1)*'STEP 1--Field Information'!F23","v":0},{"$f":"ROUNDUP(VLOOKUP('STEP 6--Choose K'!E2,'K lookup'!A2:P17,15,FALSE),-1)*'STEP 1--Field Information'!F23","v":0}]
{"$rows_left_out":5}
{"sheet":"Calcium","index":12,"n_rows":0,"n_cols":0,"rows_kept":0,"cut":false,"hidden":true,"merged":[]}

{"sheet":"Magnesium","index":13,"n_rows":0,"n_cols":0,"rows_kept":0,"cut":false,"hidden":true,"merged":[]}

{"sheet":"Sulfur","index":14,"n_rows":0,"n_cols":0,"rows_kept":0,"cut":false,"hidden":true,"merged":[]}

{"sheet":"Trace Element ","index":15,"n_rows":0,"n_cols":0,"rows_kept":0,"cut":false,"hidden":true,"merged":[]}

{"sheet":"STEP 8--Amendment Plan","index":16,"n_rows":4,"n_cols":19,"rows_kept":4,"cut":false,"hidden":false,"merged":[[1,0,1,6],[0,0,0,11],[1,7,1,11]]}
["Instructions: The information below will autofill from the calculator. Once you complete the calculator for each field, click \"Save Line\" in the left hand column, and the information will be saved in the line below. You may then start the calculator again for your next field. "]
[]
["click here to save line for each field:","Field Name","Size (acre equivalents)","Crop","pH","Lime needed (pounds per field)","lb/ acre N ","N Amendment","lb/ field N Amendment","lb/ acre P205 ","P205 Amendment","lb/ field P205 Amendment ","Recommended lb/ field unit K20 ","K20 Amendment","lb/ field K20 Amendment","Estimated cost of Amendments per field"," Pounds Ca contributed by selected fertilizlers","Pounds Mg contributed by selected fertilizlers","Pounds S contributed by selected fertilizlers"]
[null,{"$f":"'STEP 1--Field Information'!E6","v":0},{"$f":"'STEP 1--Field Information'!F23","v":1},{"$f":"'STEP 1--Field Information'!E8","v":"Mixed Vegetable"},{"$f":"'STEP 2--Soil Test Information'!B4","v":0},{"$f":"('STEP 2--Soil Test Information'!B21*C4)*2000","v":0},{"$f":"'STEP 3--Nutrient Needs'!C11","v":100},{"$f":"'STEP 4--Choose N'!D2","v":0},{"$f":"'STEP 7--Fertilizer Costs'!F4","v":{"$error":"#N/A"}},{"$f":"'STEP 3--Nutrient Needs'!D11","v":{"$error":"#N/A"}},{"$f":"'STEP 5--Choose P'!D2","v":"NONE NEEDED"},{"$f":"'STEP 7--Fertilizer Costs'!F5","v":0},{"$f":"'STEP 3--Nutrient Needs'!E11","v":{"$error":"#N/A"}},{"$f":"'STEP 6--Choose K'!E2","v":"NONE NEEDED"},{"$f":"'STEP 7--Fertilizer Costs'!F6","v":0},{"$f":"(ROUNDUP(VLOOKUP('STEP 4--Choose N'!D2,'N lookup'!A2:Q47,17,FALSE),-1)+ROUNDUP(VLOOKUP('STEP 5--Choose P'!D2,'P lookup'!A2:P16,16,FALSE),-1)+ROUNDUP(VLOOKUP('STEP 6--Choose K'!E2,'K lookup'!A2:P17,15,FALSE),-1))*'STEP 1--Field Information'!F23","v":{"$error":"#N/A"}},{"$f":"C4*(VLOOKUP('STEP 5--Choose P'!D2,'P lookup'!A2:P16,13,FALSE)+VLOOKUP('STEP 4--Choose N'!D2,'N lookup'!A2:Q47,14,FALSE)+VLOOKUP('STEP 6--Choose K'!E2,'K lookup'!A2:P17,12,FALSE))","v":{"$error":"#N/A"}},{"$f":"C4*(VLOOKUP('STEP 5--Choose P'!D2,'P lookup'!A2:P16,14,FALSE)+VLOOKUP('STEP 4--Choose N'!D2,'N lookup'!A2:Q47,15,FALSE)+VLOOKUP('STEP 6--Choose K'!E2,'K lookup'!A2:P17,13,FALSE))","v":{"$error":"#N/A"}},{"$f":"C4*(VLOOKUP('STEP 5--Choose P'!D2,'P lookup'!A2:P16,15,FALSE)+VLOOKUP('STEP 4--Choose N'!D2,'N lookup'!A2:Q47,16,FALSE)+VLOOKUP('STEP 6--Choose K'!E2,'K lookup'!A2:P17,14,FALSE))","v":{"$error":"#N/A"}}]

{"sheet":"Appendix--Fertilizer Costs","index":17,"n_rows":42,"n_cols":12,"rows_kept":42,"cut":false,"hidden":false,"merged":[]}
["MATERIAL","% N","% P2O5","% K20","% Ca","% Mg","% S","Release Rate","Price per 50 lb","$/lb N","$/lb P","$/lb K"]
["Alfalfa meal",0.03,5.0000000000000001E-3,2.5000000000000001E-2,null,null,null,"slow/ med",30,{"$f":"I2*2/(B2*100)","v":20},{"$f":"I2*2/(C2*100)","v":120},{"$f":"I2*2/(D2*100)","v":24}]
["Ammonium sulfate",0.21,null,null,null,null,0.23,"rapid",10.7,{"$f":"I3*2/(B3*100)","v":1.019047619047619}]
["Blood meal",0.12,0.01,5.0000000000000001E-3,null,null,null,"med/ rapid",68,11.333333333333334,{"$f":"I4*2/(C4*100)","v":136},{"$f":"I4*2/(D4*100)","v":272}]
["Bone char",null,0.16,null,null,null,null,"med",34,null,{"$f":"I5*2/(C5*100)","v":4.25}]
["Bone meal",0.03,0.2,null,null,null,null,"med",39,26,{"$f":"I6*2/(C6*100)","v":3.9}]
{"$rows_left_out":37}
{"sheet":"Cost per pound of Nutrients","index":18,"n_rows":56,"n_cols":12,"rows_kept":56,"cut":false,"hidden":true,"merged":[[53,0,53,7],[54,0,54,7]]}
["MATERIAL","% N","%P2 O5","%K20","%Ca","%Mg","%S","Relative Availability","Price per 50 lb (2015)","Price per pound of N","Price per pound of P","Price per pound of K"]
["Bagged Amendments"]
["Alfalfa meal",0.03,5.0000000000000001E-3,2.5000000000000001E-2,null,null,null,"Slow/ med",31,{"$f":"I3*2/3","v":20.666666666666668},{"$f":"62/0.5","v":124},{"$f":"62/2.5","v":24.8}]
["Ammonium Nitrate",0.34,null,null,null,null,null,"rapid",12,{"$f":"24/34","v":0.70588235294117652}]
["Ammonium Sulfate",0.21,null,null,null,null,0.23,"rapid"]
["Blood Meal",0.12,0.01,5.0000000000000001E-3,null,null,null,"med/ rapid",82,{"$f":"164/12","v":13.666666666666666},{"$f":"164/1","v":164},{"$f":"164/0.5","v":328}]
{"$rows_left_out":50}